BDBM103882 US10125133, Example 9::US10968221, Example 9::US9695167, 9
SMILES CN(C)[C@@H]1CCN(Cc2cc(-c3ccc(cc3)C#N)c(-c3ccc(C)cc3)n3ncnc23)C1
InChI Key InChIKey=KNVJEZKCJUEQEG-XMMPIXPASA-N
Data  3 IC50
  Tab Delimited (TSV)   2D SDfile   Computed 3D by Vconf -m prep SDfile
Find this compound or compounds like it in BindingDB:
Activity Spreadsheet -- Enzyme Inhibition Constant Data from BindingDB
Found 1 hit for monomerid = 103882
TargetLysine-specific histone demethylase 1A [151-852](Homo sapiens (Human))
Incyte
US Patent
LigandPNGBDBM103882(US10125133, Example 9 | US10968221, Example 9 | US...)
Affinity DataIC50:  75nMpH: 7.5 T: 2°C. Assay description: LANCE LSD1/KDM1A demethylase assay¿10 uL of 1 nM LSD-1 enzyme (ENZO BML-SE544-0050) in the assay buffer (50 mM Tris, pH 7.5, 0.01% Tween-20, 25 mM Na...
Ligand InfoPC cidPC sid
In DepthDetails US Patent